Reaction Details
TargetCannabinoid receptor 1
LigandBDBM50305402
Substrate/Competitorn/a
Meas. Tech.ChEMBL_603744 (CHEMBL1039369)
IC50 7±n/a nM
Citation Cooper, MReceveur, JMBjurling, ENørregaard, PKNielsen, PASköld, NHögberg, T Exploring SAR features in diverse library of 4-cyanomethyl-pyrazole-3-carboxamides suitable for further elaborations as CB1 antagonists. Bioorg Med Chem Lett20:26-30 (2010) 
 
Cannabinoid receptor 1
Name:Cannabinoid receptor 1
Type:G Protein-Coupled Receptor (GPCR)
Mol. Mass.:52868.96
Organism:Homo sapiens (Human)
Description:P21554
Residue:472
BDBM50305402
NameBDBM50305402
Synonyms:1-(2-chlorophenyl)-5-(4-chlorophenyl)-4-(cyanomethyl)-N-(2,6-dichlorobenzyl)-1H-pyrazole-3-carboxamide | CHEMBL590137
TypeSmall organic molecule
Emp. Form.C25H16Cl4N4O
Mol. Mass.530.233
SMILESClc1ccc(cc1)-c1c(CC#N)c(nn1-c1ccccc1Cl)C(=O)NCc1c(Cl)cccc1Cl