Reaction Details
TargetVasopressin V2 receptor
LigandBDBM50305509
Substrate/Competitorn/a
Meas. Tech.ChEMBL_604220 (CHEMBL1050365)
Ki>10000±n/a nM
Citation Brown, ABrown, TBCalabrese, AEllis, DPuhalo, NRalph, MWatson, L Triazole oxytocin antagonists: Identification of an aryloxyazetidine replacement for a biaryl substituent. Bioorg Med Chem Lett20:516-20 (2010) 
 
Vasopressin V2 receptor
Name:Vasopressin V2 receptor
Type:Receptor
Mol. Mass.:40295.28
Organism:Homo sapiens (Human)
Description:P30518
Residue:371
BDBM50305509
NameBDBM50305509
Synonyms:5-(3-(4-(4-fluoro-2-methylphenoxy)piperidin-1-yl)-5-methyl-4H-1,2,4-triazol-4-yl)-2-methoxypyridine | CHEMBL592494
TypeSmall organic molecule
Emp. Form.C21H24FN5O2
Mol. Mass.397.446
SMILESCOc1ccc(cn1)-n1c(C)nnc1N1CCC(CC1)Oc1ccc(F)cc1C