Reaction Details
TargetVasopressin V2 receptor
LigandBDBM50305515
Substrate/Competitorn/a
Meas. Tech.ChEMBL_604220 (CHEMBL1050365)
Ki>10000±n/a nM
Citation Brown, ABrown, TBCalabrese, AEllis, DPuhalo, NRalph, MWatson, L Triazole oxytocin antagonists: Identification of an aryloxyazetidine replacement for a biaryl substituent. Bioorg Med Chem Lett20:516-20 (2010) 
 
Vasopressin V2 receptor
Name:Vasopressin V2 receptor
Type:Receptor
Mol. Mass.:40295.28
Organism:Homo sapiens (Human)
Description:P30518
Residue:371
BDBM50305515
NameBDBM50305515
Synonyms:(R)-5-(3-(3-(4-fluoro-2-methylphenoxy)pyrrolidin-1-yl)-5-methyl-4H-1,2,4-triazol-4-yl)-2-methoxypyridine | CHEMBL591310
TypeSmall organic molecule
Emp. Form.C20H22FN5O2
Mol. Mass.383.4194
SMILESCOc1ccc(cn1)-n1c(C)nnc1N1CC[C@H](C1)Oc1ccc(F)cc1C