Reaction Details
TargetVasopressin V2 receptor
LigandBDBM50305518
Substrate/Competitorn/a
Meas. Tech.ChEMBL_604220 (CHEMBL1050365)
Ki>10000±n/a nM
Citation Brown, ABrown, TBCalabrese, AEllis, DPuhalo, NRalph, MWatson, L Triazole oxytocin antagonists: Identification of an aryloxyazetidine replacement for a biaryl substituent. Bioorg Med Chem Lett20:516-20 (2010) 
 
Vasopressin V2 receptor
Name:Vasopressin V2 receptor
Type:Receptor
Mol. Mass.:40295.28
Organism:Homo sapiens (Human)
Description:P30518
Residue:371
BDBM50305518
NameBDBM50305518
Synonyms:(R)-5-(3-(3-(3,5-difluoro-2-methylphenoxy)pyrrolidin-1-yl)-5-(methoxymethyl)-4H-1,2,4-triazol-4-yl)-2-methoxypyridine | CHEMBL609848
TypeSmall organic molecule
Emp. Form.C21H23F2N5O3
Mol. Mass.431.4358
SMILESCOCc1nnc(N2CC[C@H](C2)Oc2cc(F)cc(F)c2C)n1-c1ccc(OC)nc1