Reaction Details
TargetVasopressin V2 receptor
LigandBDBM50305523
Substrate/Competitorn/a
Meas. Tech.ChEMBL_604220 (CHEMBL1050365)
Ki>10000±n/a nM
Citation Brown, ABrown, TBCalabrese, AEllis, DPuhalo, NRalph, MWatson, L Triazole oxytocin antagonists: Identification of an aryloxyazetidine replacement for a biaryl substituent. Bioorg Med Chem Lett20:516-20 (2010) 
 
Vasopressin V2 receptor
Name:Vasopressin V2 receptor
Type:Receptor
Mol. Mass.:40295.28
Organism:Homo sapiens (Human)
Description:P30518
Residue:371
BDBM50305523
NameBDBM50305523
Synonyms:5-(3-(3-(2-chloro-4-fluorophenoxy)azetidin-1-yl)-5-methyl-4H-1,2,4-triazol-4-yl)-2-methoxypyridine | CHEMBL589125
TypeSmall organic molecule
Emp. Form.C18H17ClFN5O2
Mol. Mass.389.811
SMILESCOc1ccc(cn1)-n1c(C)nnc1N1CC(C1)Oc1ccc(F)cc1Cl