Reaction Details
TargetOxytocin receptor
LigandBDBM50305511
Substrate/Competitorn/a
Meas. Tech.ChEMBL_604218 (CHEMBL1050363)
Ki 0.4±n/a nM
Citation Brown, ABrown, TBCalabrese, AEllis, DPuhalo, NRalph, MWatson, L Triazole oxytocin antagonists: Identification of an aryloxyazetidine replacement for a biaryl substituent. Bioorg Med Chem Lett20:516-20 (2010) 
 
Oxytocin receptor
Name:Oxytocin receptor
Type:Enzyme Catalytic Domain
Mol. Mass.:42793.26
Organism:Homo sapiens (Human)
Description:Oxytocin OXTR HEK293::B2R9L7
Residue:389
BDBM50305511
NameBDBM50305511
Synonyms:5-(3-(4-(3,5-difluoro-2-methylphenoxy)piperidin-1-yl)-5-methyl-4H-1,2,4-triazol-4-yl)-2-methoxypyridine | CHEMBL606976
TypeSmall organic molecule
Emp. Form.C21H23F2N5O2
Mol. Mass.415.4364
SMILESCOc1ccc(cn1)-n1c(C)nnc1N1CCC(CC1)Oc1cc(F)cc(F)c1C