Reaction Details
TargetOxytocin receptor
LigandBDBM50305518
Substrate/Competitorn/a
Meas. Tech.ChEMBL_604218 (CHEMBL1050363)
Ki 5.8±n/a nM
Citation Brown, ABrown, TBCalabrese, AEllis, DPuhalo, NRalph, MWatson, L Triazole oxytocin antagonists: Identification of an aryloxyazetidine replacement for a biaryl substituent. Bioorg Med Chem Lett20:516-20 (2010) 
 
Oxytocin receptor
Name:Oxytocin receptor
Type:Enzyme Catalytic Domain
Mol. Mass.:42793.26
Organism:Homo sapiens (Human)
Description:Oxytocin OXTR HEK293::B2R9L7
Residue:389
BDBM50305518
NameBDBM50305518
Synonyms:(R)-5-(3-(3-(3,5-difluoro-2-methylphenoxy)pyrrolidin-1-yl)-5-(methoxymethyl)-4H-1,2,4-triazol-4-yl)-2-methoxypyridine | CHEMBL609848
TypeSmall organic molecule
Emp. Form.C21H23F2N5O3
Mol. Mass.431.4358
SMILESCOCc1nnc(N2CC[C@H](C2)Oc2cc(F)cc(F)c2C)n1-c1ccc(OC)nc1