Reaction Details
TargetOxytocin receptor
LigandBDBM50305522
Substrate/Competitorn/a
Meas. Tech.ChEMBL_604218 (CHEMBL1050363)
Ki 32.5±n/a nM
Citation Brown, ABrown, TBCalabrese, AEllis, DPuhalo, NRalph, MWatson, L Triazole oxytocin antagonists: Identification of an aryloxyazetidine replacement for a biaryl substituent. Bioorg Med Chem Lett20:516-20 (2010) 
 
Oxytocin receptor
Name:Oxytocin receptor
Type:Enzyme Catalytic Domain
Mol. Mass.:42793.26
Organism:Homo sapiens (Human)
Description:Oxytocin OXTR HEK293::B2R9L7
Residue:389
BDBM50305522
NameBDBM50305522
Synonyms:5-(3-(3-(2-chlorophenoxy)azetidin-1-yl)-5-(methoxymethyl)-4H-1,2,4-triazol-4-yl)-2-methoxypyridine | CHEMBL590349
TypeSmall organic molecule
Emp. Form.C19H20ClN5O3
Mol. Mass.401.847
SMILESCOCc1nnc(N2CC(C2)Oc2ccccc2Cl)n1-c1ccc(OC)nc1