Reaction Details
TargetBifunctional epoxide hydrolase 2
LigandBDBM50305635
Substrate/Competitorn/a
Meas. Tech.ChEMBL_604538 (CHEMBL1074708)
IC50 3.9±n/a nM
Citation Eldrup, ABSoleymanzadeh, FFarrow, NAKukulka, ADe Lombaert, S Optimization of piperidyl-ureas as inhibitors of soluble epoxide hydrolase. Bioorg Med Chem Lett20:571-5 (2010) 
 
Bifunctional epoxide hydrolase 2
Name:Bifunctional epoxide hydrolase 2
Type:Enzyme
Mol. Mass.:62613.07
Organism:Homo sapiens (Human)
Description:P34913
Residue:555
BDBM50305635
NameBDBM50305635
Synonyms:4-(2-cyanophenoxy)-N-(2,4-dichlorobenzyl)piperidine-1-carboxamide | CHEMBL589376
TypeSmall organic molecule
Emp. Form.C20H19Cl2N3O2
Mol. Mass.404.29
SMILESClc1ccc(CNC(=O)N2CCC(CC2)Oc2ccccc2C#N)c(Cl)c1