Reaction Details
TargetC5a anaphylatoxin chemotactic receptor 1
LigandBDBM50305732
Substrate/Competitorn/a
Meas. Tech.ChEMBL_604749 (CHEMBL1072543)
IC50>60000±n/a nM
Citation Chen, JJCole, DCCiszewski, GCrouse, KEllingboe, JWNowak, PTawa, GJBerstein, GLi, W Identification of a new class of small molecule C5a receptor antagonists. Bioorg Med Chem Lett20:662-4 (2010) 
 
C5a anaphylatoxin chemotactic receptor 1
Name:C5a anaphylatoxin chemotactic receptor 1
Type:Enzyme
Mol. Mass.:39347.68
Organism:Homo sapiens (Human)
Description:P21730
Residue:350
BDBM50305732
NameBDBM50305732
Synonyms:CHEMBL595824 | N-(2-benzoyl-4-chlorophenyl)-N,4-dimethylbenzenesulfonamide
TypeSmall organic molecule
Emp. Form.C21H18ClNO3S
Mol. Mass.399.891
SMILESCN(c1ccc(Cl)cc1C(=O)c1ccccc1)S(=O)(=O)c1ccc(C)cc1