Reaction Details
TargetC5a anaphylatoxin chemotactic receptor 1
LigandBDBM50305737
Substrate/Competitorn/a
Meas. Tech.ChEMBL_604749 (CHEMBL1072543)
IC50 300±n/a nM
Citation Chen, JJCole, DCCiszewski, GCrouse, KEllingboe, JWNowak, PTawa, GJBerstein, GLi, W Identification of a new class of small molecule C5a receptor antagonists. Bioorg Med Chem Lett20:662-4 (2010) 
 
C5a anaphylatoxin chemotactic receptor 1
Name:C5a anaphylatoxin chemotactic receptor 1
Type:Enzyme
Mol. Mass.:39347.68
Organism:Homo sapiens (Human)
Description:P21730
Residue:350
BDBM50305737
NameBDBM50305737
Synonyms:CHEMBL604277 | N,N'-(1,2-phenylene)bis(N-allyl-4-methylbenzenesulfonamide)
TypeSmall organic molecule
Emp. Form.C26H28N2O4S2
Mol. Mass.496.642
SMILESCc1ccc(cc1)S(=O)(=O)N(CC=C)c1ccccc1N(CC=C)S(=O)(=O)c1ccc(C)cc1