Reaction Details
TargetC5a anaphylatoxin chemotactic receptor 1
LigandBDBM50305731
Substrate/Competitorn/a
Meas. Tech.ChEMBL_604751 (CHEMBL1072545)
IC50 400±n/a nM
Citation Chen, JJCole, DCCiszewski, GCrouse, KEllingboe, JWNowak, PTawa, GJBerstein, GLi, W Identification of a new class of small molecule C5a receptor antagonists. Bioorg Med Chem Lett20:662-4 (2010) 
 
C5a anaphylatoxin chemotactic receptor 1
Name:C5a anaphylatoxin chemotactic receptor 1
Type:Enzyme
Mol. Mass.:39347.68
Organism:Homo sapiens (Human)
Description:P21730
Residue:350
BDBM50305731
NameBDBM50305731
Synonyms:CHEMBL604583 | N,4-dimethyl-N-(2-(thiophene-3-carbonyl)phenyl)benzenesulfonamide
TypeSmall organic molecule
Emp. Form.C19H17NO3S2
Mol. Mass.371.473
SMILESCN(c1ccccc1C(=O)c1ccsc1)S(=O)(=O)c1ccc(C)cc1