Reaction Details
TargetP2Y purinoceptor 2
LigandBDBM50305735
Substrate/Competitorn/a
Meas. Tech.ChEMBL_604757 (CHEMBL1072551)
IC50>60000±n/a nM
Citation Chen, JJCole, DCCiszewski, GCrouse, KEllingboe, JWNowak, PTawa, GJBerstein, GLi, W Identification of a new class of small molecule C5a receptor antagonists. Bioorg Med Chem Lett20:662-4 (2010) 
 
P2Y purinoceptor 2
Name:P2Y purinoceptor 2
Type:PROTEIN
Mol. Mass.:42299.21
Organism:Homo sapiens (Human)
Description:ChEMBL_1455361
Residue:377
BDBM50305735
NameBDBM50305735
Synonyms:CHEMBL595990 | N,N'-(1,2-phenylene)bis(N-methyl-1-phenylmethanesulfonamide)
TypeSmall organic molecule
Emp. Form.C22H24N2O4S2
Mol. Mass.444.567
SMILESCN(c1ccccc1N(C)S(=O)(=O)c1ccc(C)cc1)S(=O)(=O)c1ccc(C)cc1