Reaction Details
TargetC-X-C chemokine receptor type 4
LigandBDBM50305735
Substrate/Competitorn/a
Meas. Tech.ChEMBL_604756 (CHEMBL1072550)
IC50>60000±n/a nM
Citation Chen, JJCole, DCCiszewski, GCrouse, KEllingboe, JWNowak, PTawa, GJBerstein, GLi, W Identification of a new class of small molecule C5a receptor antagonists. Bioorg Med Chem Lett20:662-4 (2010) 
 
C-X-C chemokine receptor type 4
Name:C-X-C chemokine receptor type 4
Type:Enzyme
Mol. Mass.:39754.61
Organism:Homo sapiens (Human)
Description:P61073
Residue:352
BDBM50305735
NameBDBM50305735
Synonyms:CHEMBL595990 | N,N'-(1,2-phenylene)bis(N-methyl-1-phenylmethanesulfonamide)
TypeSmall organic molecule
Emp. Form.C22H24N2O4S2
Mol. Mass.444.567
SMILESCN(c1ccccc1N(C)S(=O)(=O)c1ccc(C)cc1)S(=O)(=O)c1ccc(C)cc1