Reaction Details
TargetMuscarinic acetylcholine receptor M5
LigandBDBM50258656
Substrate/Competitorn/a
Meas. Tech.ChEMBL_605048 (CHEMBL1071910)
EC50 1100±n/a nM
Citation Bridges, TMKennedy, JPCho, HPBreininger, MLGentry, PRHopkins, CRConn, PJLindsley, CW Chemical lead optimization of a pan G(q) mAChR M(1), M(3), M(5) positive allosteric modulator (PAM) lead. Part I: Development of the first highly selective M(5) PAM. Bioorg Med Chem Lett20:558-62 (2010) 
 
Muscarinic acetylcholine receptor M5
Name:Muscarinic acetylcholine receptor M5
Type:PROTEIN
Mol. Mass.:60102.35
Organism:Homo sapiens (Human)
Description:ChEMBL_1517990
Residue:532
BDBM50258656
NameBDBM50258656
Synonyms:1-(4-methoxybenzyl)-5-(trifluoromethoxy)indoline-2,3-dione VU0238429 | cid_42633508
TypeSmall organic molecule
Emp. Form.C17H12F3NO4
Mol. Mass.351.2767
SMILESCOc1ccc(CN2C(=O)C(=O)c3cc(OC(F)(F)F)ccc23)cc1