Reaction Details
TargetCollagenase 3
LigandBDBM50305834
Substrate/Competitorn/a
Meas. Tech.ChEMBL_605223 (CHEMBL1069934)
Ki 227±n/a nM
Citation Schnute, MEO'Brien, PMNahra, JMorris, MHoward Roark, WHanau, CERuminski, PGScholten, JAFletcher, TRHamper, BCCarroll, JNPatt, WCShieh, HSCollins, BPavlovsky, AGPalmquist, KEAston, KWHitchcock, JRogers, MDMcDonald, JJohnson, ARMunie, GEWittwer, AJMan, CFSettle, SLNemirovskiy, OVickery, LEAgawal, ADyer, RDSunyer, T Discovery of (pyridin-4-yl)-2H-tetrazole as a novel scaffold to identify highly selective matrix metalloproteinase-13 inhibitors for the treatment of osteoarthritis. Bioorg Med Chem Lett20:576-80 (2010) 
 
Collagenase 3
Name:Collagenase 3
Type:Enzyme
Mol. Mass.:53808.06
Organism:Homo sapiens (Human)
Description:P45452
Residue:471
BDBM50305834
NameBDBM50305834
Synonyms:4-((5-(2-(4-chlorobenzylcarbamoyl)pyridin-4-yl)-2H-tetrazol-2-yl)methyl)benzoic acid | CHEMBL596301
TypeSmall organic molecule
Emp. Form.C22H17ClN6O3
Mol. Mass.448.862
SMILESOC(=O)c1ccc(Cn2nnc(n2)-c2ccnc(c2)C(=O)NCc2ccc(Cl)cc2)cc1