Reaction Details
TargetCollagenase 3
LigandBDBM50305847
Substrate/Competitorn/a
Meas. Tech.ChEMBL_605223 (CHEMBL1069934)
Ki 4.2±n/a nM
Citation Schnute, MEO'Brien, PMNahra, JMorris, MHoward Roark, WHanau, CERuminski, PGScholten, JAFletcher, TRHamper, BCCarroll, JNPatt, WCShieh, HSCollins, BPavlovsky, AGPalmquist, KEAston, KWHitchcock, JRogers, MDMcDonald, JJohnson, ARMunie, GEWittwer, AJMan, CFSettle, SLNemirovskiy, OVickery, LEAgawal, ADyer, RDSunyer, T Discovery of (pyridin-4-yl)-2H-tetrazole as a novel scaffold to identify highly selective matrix metalloproteinase-13 inhibitors for the treatment of osteoarthritis. Bioorg Med Chem Lett20:576-80 (2010) 
 
Collagenase 3
Name:Collagenase 3
Type:Enzyme
Mol. Mass.:53808.06
Organism:Homo sapiens (Human)
Description:P45452
Residue:471
BDBM50305847
NameBDBM50305847
Synonyms:CHEMBL596304 | trans-4-((5-(2-(4-methoxybenzylcarbamoyl)-6-methylpyridin-4-yl)-2H-tetrazol-2-yl)methyl)cyclohexanecarboxylic acid
TypeSmall organic molecule
Emp. Form.C24H28N6O4
Mol. Mass.464.5169
SMILESCOc1ccc(CNC(=O)c2cc(cc(C)n2)-c2nnn(C[C@H]3CC[C@@H](CC3)C(O)=O)n2)cc1