Reaction Details
TargetRAC-alpha serine/threonine-protein kinase
LigandBDBM50306085
Substrate/Competitorn/a
Meas. Tech.ChEMBL_606053 (CHEMBL1071952)
IC50 63±n/a nM
Citation Lin, HYamashita, DSZeng, JXie, RWang, WNidarmarthy, SLuengo, JIRhodes, NKnick, VBChoudhry, AELai, ZMinthorn, EAStrum, SLWood, ERElkins, PAConcha, NOHeerding, DA 2,3,5-Trisubstituted pyridines as selective AKT inhibitors-Part I: Substitution at 2-position of the core pyridine for ROCK1 selectivity. Bioorg Med Chem Lett20:673-8 (2010) 
 
RAC-alpha serine/threonine-protein kinase
Name:RAC-alpha serine/threonine-protein kinase
Type:Enzyme
Mol. Mass.:55681.25
Organism:Homo sapiens (Human)
Description:P31749
Residue:480
BDBM50306085
NameBDBM50306085
Synonyms:2-(5-((S)-2-amino-3-phenylpropoxy)-3-(3-methyl-1H-indazol-5-yl)pyridin-2-yl)-4,6-difluorophenol | CHEMBL596379
TypeSmall organic molecule
Emp. Form.C28H24F2N4O2
Mol. Mass.486.5126
SMILESCc1n[nH]c2ccc(cc12)-c1cc(OC[C@@H](N)Cc2ccccc2)cnc1-c1cc(F)cc(F)c1O