Reaction Details
TargetRho-associated protein kinase 1
LigandBDBM50306102
Substrate/Competitorn/a
Meas. Tech.ChEMBL_606055 (CHEMBL1071954)
IC50 2500±n/a nM
Citation Lin, HYamashita, DSZeng, JXie, RWang, WNidarmarthy, SLuengo, JIRhodes, NKnick, VBChoudhry, AELai, ZMinthorn, EAStrum, SLWood, ERElkins, PAConcha, NOHeerding, DA 2,3,5-Trisubstituted pyridines as selective AKT inhibitors-Part I: Substitution at 2-position of the core pyridine for ROCK1 selectivity. Bioorg Med Chem Lett20:673-8 (2010) 
 
Rho-associated protein kinase 1
Name:Rho-associated protein kinase 1
Type:Serine/threonine-protein kinase
Mol. Mass.:158156.77
Organism:Homo sapiens (Human)
Description:Q13464
Residue:1354
BDBM50306102
NameBDBM50306102
Synonyms:(S)-1-(5-(3-methyl-1H-indazol-5-yl)-6-(thiophen-2-yl)pyridin-3-yloxy)-3-phenylpropan-2-amine | CHEMBL594748
TypeSmall organic molecule
Emp. Form.C26H24N4OS
Mol. Mass.440.56
SMILESCc1n[nH]c2ccc(cc12)-c1cc(OC[C@@H](N)Cc2ccccc2)cnc1-c1cccs1