Reaction Details
TargetRho-associated protein kinase 1
LigandBDBM50306088
Substrate/Competitorn/a
Meas. Tech.ChEMBL_606055 (CHEMBL1071954)
IC50>10000±n/a nM
Citation Lin, HYamashita, DSZeng, JXie, RWang, WNidarmarthy, SLuengo, JIRhodes, NKnick, VBChoudhry, AELai, ZMinthorn, EAStrum, SLWood, ERElkins, PAConcha, NOHeerding, DA 2,3,5-Trisubstituted pyridines as selective AKT inhibitors-Part I: Substitution at 2-position of the core pyridine for ROCK1 selectivity. Bioorg Med Chem Lett20:673-8 (2010) 
 
Rho-associated protein kinase 1
Name:Rho-associated protein kinase 1
Type:Serine/threonine-protein kinase
Mol. Mass.:158156.77
Organism:Homo sapiens (Human)
Description:Q13464
Residue:1354
BDBM50306088
NameBDBM50306088
Synonyms:(S)-3-(5-(2-amino-3-phenylpropoxy)-3-(3-methyl-1H-indazol-5-yl)pyridin-2-yl)phenol | CHEMBL595684
TypeSmall organic molecule
Emp. Form.C28H26N4O2
Mol. Mass.450.5316
SMILESCc1n[nH]c2ccc(cc12)-c1cc(OC[C@@H](N)Cc2ccccc2)cnc1-c1cccc(O)c1