Reaction Details
TargetRAC-alpha serine/threonine-protein kinase
LigandBDBM50306104
Substrate/Competitorn/a
Meas. Tech.ChEMBL_606054 (CHEMBL1071953)
IC50 790±n/a nM
Citation Lin, HYamashita, DSZeng, JXie, RWang, WNidarmarthy, SLuengo, JIRhodes, NKnick, VBChoudhry, AELai, ZMinthorn, EAStrum, SLWood, ERElkins, PAConcha, NOHeerding, DA 2,3,5-Trisubstituted pyridines as selective AKT inhibitors-Part I: Substitution at 2-position of the core pyridine for ROCK1 selectivity. Bioorg Med Chem Lett20:673-8 (2010) 
 
RAC-alpha serine/threonine-protein kinase
Name:RAC-alpha serine/threonine-protein kinase
Type:Enzyme
Mol. Mass.:55681.25
Organism:Homo sapiens (Human)
Description:P31749
Residue:480
BDBM50306104
NameBDBM50306104
Synonyms:(S)-1-(6-(furan-2-yl)-5-(3-methyl-1H-indazol-5-yl)pyridin-3-yloxy)-3-phenylpropan-2-amine | CHEMBL595708
TypeSmall organic molecule
Emp. Form.C26H24N4O2
Mol. Mass.424.4944
SMILESCc1n[nH]c2ccc(cc12)-c1cc(OC[C@@H](N)Cc2ccccc2)cnc1-c1ccco1