Reaction Details
TargetRAC-alpha serine/threonine-protein kinase
LigandBDBM50306097
Substrate/Competitorn/a
Meas. Tech.ChEMBL_606053 (CHEMBL1071952)
IC50 0.8±n/a nM
Citation Lin, HYamashita, DSZeng, JXie, RWang, WNidarmarthy, SLuengo, JIRhodes, NKnick, VBChoudhry, AELai, ZMinthorn, EAStrum, SLWood, ERElkins, PAConcha, NOHeerding, DA 2,3,5-Trisubstituted pyridines as selective AKT inhibitors-Part I: Substitution at 2-position of the core pyridine for ROCK1 selectivity. Bioorg Med Chem Lett20:673-8 (2010) 
 
RAC-alpha serine/threonine-protein kinase
Name:RAC-alpha serine/threonine-protein kinase
Type:Enzyme
Mol. Mass.:55681.25
Organism:Homo sapiens (Human)
Description:P31749
Residue:480
BDBM50306097
NameBDBM50306097
Synonyms:(2S)-1-(1H-indol-3-yl)-3-(5-(3-methyl-1H-indazol-5-yl)-6-(2-methylfuran-3-yl)pyridin-3-yloxy)propan-2-amine | CHEMBL595939
TypeSmall organic molecule
Emp. Form.C29H27N5O2
Mol. Mass.477.557
SMILESCc1n[nH]c2ccc(cc12)-c1cc(OC[C@@H](N)Cc2c[nH]c3ccccc23)cnc1-c1ccoc1C