Reaction Details
TargetPoly [ADP-ribose] polymerase 1
LigandBDBM50306166
Substrate/Competitorn/a
Meas. Tech.ChEMBL_606737 (CHEMBL1065327)
IC50 25±n/a nM
Citation Scarpelli, RBoueres, JKCerretani, MFerrigno, FOntoria, JMRowley, MSchultz-Fademrecht, CToniatti, CJones, P Synthesis and biological evaluation of substituted 2-phenyl-2H-indazole-7-carboxamides as potent poly(ADP-ribose) polymerase (PARP) inhibitors. Bioorg Med Chem Lett20:488-92 (2010) 
 
Poly [ADP-ribose] polymerase 1
Name:Poly [ADP-ribose] polymerase 1
Type:n/a
Mol. Mass.:113114.22
Organism:Homo sapiens (Human)
Description:P09874
Residue:1014
BDBM50306166
NameBDBM50306166
Synonyms:2-phenyl-2H-indazole-7-carboxamide | CHEMBL594298
TypeSmall organic molecule
Emp. Form.C14H11N3O
Mol. Mass.237.2566
SMILESNC(=O)c1cccc2cn(nc12)-c1ccccc1