Reaction Details
TargetPoly [ADP-ribose] polymerase 1
LigandBDBM50306209
Substrate/Competitorn/a
Meas. Tech.ChEMBL_606737 (CHEMBL1065327)
IC50 10±n/a nM
Citation Scarpelli, RBoueres, JKCerretani, MFerrigno, FOntoria, JMRowley, MSchultz-Fademrecht, CToniatti, CJones, P Synthesis and biological evaluation of substituted 2-phenyl-2H-indazole-7-carboxamides as potent poly(ADP-ribose) polymerase (PARP) inhibitors. Bioorg Med Chem Lett20:488-92 (2010) 
 
Poly [ADP-ribose] polymerase 1
Name:Poly [ADP-ribose] polymerase 1
Type:n/a
Mol. Mass.:113114.22
Organism:Homo sapiens (Human)
Description:P09874
Residue:1014
BDBM50306209
NameBDBM50306209
Synonyms:2-(4-(2-(dimethylamino)ethylcarbamoyl)phenyl)-2H-indazole-7-carboxamide | CHEMBL593144
TypeSmall organic molecule
Emp. Form.C19H21N5O2
Mol. Mass.351.4023
SMILESCN(C)CCNC(=O)c1ccc(cc1)-n1cc2cccc(C(N)=O)c2n1