Reaction Details
TargetReceptor-type tyrosine-protein phosphatase beta
LigandBDBM50306213
Substrate/Competitorn/a
Meas. Tech.ChEMBL_606745 (CHEMBL1065335)
IC50 130±n/a nM
Citation Vovk, AIKononets, LATanchuk, VYCherenok, SODrapailo, ABKalchenko, VIKukhar, VP Inhibition of Yersinia protein tyrosine phosphatase by phosphonate derivatives of calixarenes. Bioorg Med Chem Lett20:483-7 (2010) 
 
Receptor-type tyrosine-protein phosphatase beta
Name:Receptor-type tyrosine-protein phosphatase beta
Type:Protein
Mol. Mass.:224324.80
Organism:Homo sapiens (Human)
Description:P23467
Residue:1997
BDBM50306213
NameBDBM50306213
Synonyms:CHEMBL611318 | {[25,26,27,28-tetrahydroxy-11,17,23-tris(phosphonomethyl)-2,8,14,20-tetrathiapentacyclo[19.3.1.1^{3,7}.1^{9,13}.1^{15,19}]octacosa-1(25),3(28),4,6,9,11,13(27),15,17,19(26),21,23-dodecaen-5-yl]methyl}phosphonic acid
TypeSmall organic molecule
Emp. Form.C28H28O16P4S4
Mol. Mass.872.667
SMILESOc1c2cc(CP(O)(O)=O)cc1sc1cc(CP(O)(O)=O)cc(sc3cc(CP(O)(O)=O)cc(sc4cc(CP(O)(O)=O)cc(s2)c4O)c3O)c1O