Reaction Details
TargetPoly [ADP-ribose] polymerase 1
LigandBDBM50306262
Substrate/Competitorn/a
Meas. Tech.ChEMBL_607020 (CHEMBL1074648)
EC50 3200±n/a nM
Citation Torrisi, CBisbocci, MIngenito, ROntoria, JMRowley, MSchultz-Fademrecht, CToniatti, CJones, P Discovery and SAR of novel, potent and selective hexahydrobenzonaphthyridinone inhibitors of poly(ADP-ribose)polymerase-1 (PARP-1). Bioorg Med Chem Lett20:448-52 (2010) 
 
Poly [ADP-ribose] polymerase 1
Name:Poly [ADP-ribose] polymerase 1
Type:n/a
Mol. Mass.:113114.22
Organism:Homo sapiens (Human)
Description:P09874
Residue:1014
BDBM50306262
NameBDBM50306262
Synonyms:1-(pyrrolidine-3-carbonyl)-2,3,9,9a-tetrahydro-1H-benzo[de][1,7]naphthyridin-7(8H)-one | CHEMBL593363
TypeSmall organic molecule
Emp. Form.C16H19N3O2
Mol. Mass.285.341
SMILESO=C(C1CCNC1)N1CCc2cccc3C(=O)NCC1c23