Reaction Details
TargetPoly [ADP-ribose] polymerase 1
LigandBDBM50306249
Substrate/Competitorn/a
Meas. Tech.ChEMBL_607019 (CHEMBL1074647)
IC50 16±n/a nM
Citation Torrisi, CBisbocci, MIngenito, ROntoria, JMRowley, MSchultz-Fademrecht, CToniatti, CJones, P Discovery and SAR of novel, potent and selective hexahydrobenzonaphthyridinone inhibitors of poly(ADP-ribose)polymerase-1 (PARP-1). Bioorg Med Chem Lett20:448-52 (2010) 
 
Poly [ADP-ribose] polymerase 1
Name:Poly [ADP-ribose] polymerase 1
Type:n/a
Mol. Mass.:113114.22
Organism:Homo sapiens (Human)
Description:P09874
Residue:1014
BDBM50306249
NameBDBM50306249
Synonyms:1-(2-(4-(benzyloxy)phenyl)acetyl)-2,3,9,9a-tetrahydro-1H-benzo[de][1,7]naphthyridin-7(8H)-one | CHEMBL594522
TypeSmall organic molecule
Emp. Form.C26H24N2O3
Mol. Mass.412.4804
SMILESO=C(Cc1ccc(OCc2ccccc2)cc1)N1CCc2cccc3C(=O)NCC1c23