Reaction Details
TargetPoly [ADP-ribose] polymerase 1
LigandBDBM50306269
Substrate/Competitorn/a
Meas. Tech.ChEMBL_607019 (CHEMBL1074647)
IC50 15±n/a nM
Citation Torrisi, CBisbocci, MIngenito, ROntoria, JMRowley, MSchultz-Fademrecht, CToniatti, CJones, P Discovery and SAR of novel, potent and selective hexahydrobenzonaphthyridinone inhibitors of poly(ADP-ribose)polymerase-1 (PARP-1). Bioorg Med Chem Lett20:448-52 (2010) 
 
Poly [ADP-ribose] polymerase 1
Name:Poly [ADP-ribose] polymerase 1
Type:n/a
Mol. Mass.:113114.22
Organism:Homo sapiens (Human)
Description:P09874
Residue:1014
BDBM50306269
NameBDBM50306269
Synonyms:5-oxo-5-(7-oxo-2,3,7,8,9,9a-hexahydro-1H-benzo[de][1,7]naphthyridin-1-yl)pentanoic acid | CHEMBL595681
TypeSmall organic molecule
Emp. Form.C16H18N2O4
Mol. Mass.302.3251
SMILESOC(=O)CCCC(=O)N1CCc2cccc3C(=O)NCC1c23