Reaction Details
TargetSodium-dependent serotonin transporter
LigandBDBM50306470
Substrate/Competitorn/a
Meas. Tech.ChEMBL_609921 (CHEMBL1074783)
Ki 3.36±n/a nM
Citation Venkatesan, AMDos Santos, OEllingboe, JEvrard, DAHarrison, BLSmith, DLScerni, RHornby, GASchechter, LEAndree, TH Novel benzofuran derivatives with dual 5-HT1A receptor and serotonin transporter affinity. Bioorg Med Chem Lett20:824-7 (2010) 
 
Sodium-dependent serotonin transporter
Name:Sodium-dependent serotonin transporter
Type:Multi-pass membrane protein
Mol. Mass.:70168.43
Organism:Rattus norvegicus (rat)
Description:P31652
Residue:630
BDBM50306470
NameBDBM50306470
Synonyms:3-(1-(2-(6-methoxybenzofuran-3-yl)ethyl)-1,2,3,6-tetrahydropyridin-4-yl)-1H-indole-5-carbonitrile | CHEMBL599076
TypeSmall organic molecule
Emp. Form.C25H23N3O2
Mol. Mass.397.469
SMILESCOc1ccc2c(CCN3CCC(=CC3)c3c[nH]c4ccc(cc34)C#N)coc2c1