Reaction Details
Target5-hydroxytryptamine receptor 1A
LigandBDBM50306469
Substrate/Competitorn/a
Meas. Tech.ChEMBL_609919 (CHEMBL1074781)
Ki 303±n/a nM
Citation Venkatesan, AMDos Santos, OEllingboe, JEvrard, DAHarrison, BLSmith, DLScerni, RHornby, GASchechter, LEAndree, TH Novel benzofuran derivatives with dual 5-HT1A receptor and serotonin transporter affinity. Bioorg Med Chem Lett20:824-7 (2010) 
 
5-hydroxytryptamine receptor 1A
Name:5-hydroxytryptamine receptor 1A
Type:n/a
Mol. Mass.:46122.49
Organism:Homo sapiens (Human)
Description:n/a
Residue:422
BDBM50306469
NameBDBM50306469
Synonyms:6-fluoro-3-(1-(2-(6-methoxybenzofuran-3-yl)ethyl)-1,2,3,6-tetrahydropyridin-4-yl)-1H-indole | CHEMBL590245
TypeSmall organic molecule
Emp. Form.C24H23FN2O2
Mol. Mass.390.45
SMILESCOc1ccc2c(CCN3CCC(=CC3)c3c[nH]c4cc(F)ccc34)coc2c1