Reaction Details
TargetVascular endothelial growth factor receptor 2
LigandBDBM50248557
Substrate/Competitorn/a
Meas. Tech.ChEMBL_610267 (CHEMBL1067992)
IC50 10±n/a nM
Citation Gaudette, FRaeppel, SNguyen, HBeaulieu, NBeaulieu, CDupont, IMacleod, ARBesterman, JMVaisburg, A Identification of potent and selective VEGFR receptor tyrosine kinase inhibitors having new amide isostere headgroups. Bioorg Med Chem Lett20:848-52 (2010) 
 
Vascular endothelial growth factor receptor 2
Name:Vascular endothelial growth factor receptor 2
Type:Receptor Tyrosine Kinase
Mol. Mass.:151510.97
Organism:Homo sapiens (Human)
Description:P35968
Residue:1356
BDBM50248557
NameBDBM50248557
Synonyms:CHEMBL465130 | N1-(3-fluoro-4-(2-(1-methyl-1H-imidazol-4-yl)thieno[3,2-b]pyridin-7-yloxy)phenyl)-N3-methyl-N3-phenylmalonamide
TypeSmall organic molecule
Emp. Form.C27H22FN5O3S
Mol. Mass.515.559
SMILESCN(C(=O)CC(=O)Nc1ccc(Oc2ccnc3cc(sc23)-c2cn(C)cn2)c(F)c1)c1ccccc1