Reaction Details
TargetPeroxisome proliferator-activated receptor alpha
LigandBDBM50306511
Substrate/Competitorn/a
Meas. Tech.ChEMBL_610590 (CHEMBL1068982)
IC50>10000±n/a nM
Citation Lamotte, YMartres, PFaucher, NLaroze, AGrillot, DAncellin, NSaintillan, YBeneton, VGampe, RT Synthesis and biological activities of novel indole derivatives as potent and selective PPARgamma modulators. Bioorg Med Chem Lett20:1399-404 (2010) 
 
Peroxisome proliferator-activated receptor alpha
Name:Peroxisome proliferator-activated receptor alpha
Type:Enzyme
Mol. Mass.:52222.08
Organism:Homo sapiens (Human)
Description:Q07869
Residue:468
BDBM50306511
NameBDBM50306511
Synonyms:4'-((3-(methylthio)-6-(2-phenylbutanamido)-2-propyl-1H-indol-1-yl)methyl)biphenyl-2-carboxylic acid | CHEMBL590984
TypeSmall organic molecule
Emp. Form.C36H36N2O3S
Mol. Mass.576.748
SMILESCCCc1c(SC)c2ccc(NC(=O)C(CC)c3ccccc3)cc2n1Cc1ccc(cc1)-c1ccccc1C(O)=O