Reaction Details
TargetPeroxisome proliferator-activated receptor alpha
LigandBDBM50306508
Substrate/Competitorn/a
Meas. Tech.ChEMBL_610590 (CHEMBL1068982)
IC50>10000±n/a nM
Citation Lamotte, YMartres, PFaucher, NLaroze, AGrillot, DAncellin, NSaintillan, YBeneton, VGampe, RT Synthesis and biological activities of novel indole derivatives as potent and selective PPARgamma modulators. Bioorg Med Chem Lett20:1399-404 (2010) 
 
Peroxisome proliferator-activated receptor alpha
Name:Peroxisome proliferator-activated receptor alpha
Type:Enzyme
Mol. Mass.:52222.08
Organism:Homo sapiens (Human)
Description:Q07869
Residue:468
BDBM50306508
NameBDBM50306508
Synonyms:4'-((2,3-dimethyl-5-(1-phenylpropylcarbamoyl)-1H-indol-1-yl)methyl)biphenyl-2-carboxylic acid | CHEMBL602468
TypeSmall organic molecule
Emp. Form.C34H32N2O3
Mol. Mass.516.6295
SMILESCCC(NC(=O)c1ccc2n(Cc3ccc(cc3)-c3ccccc3C(O)=O)c(C)c(C)c2c1)c1ccccc1