Reaction Details
TargetPeroxisome proliferator-activated receptor alpha
LigandBDBM50306518
Substrate/Competitorn/a
Meas. Tech.ChEMBL_610586 (CHEMBL1068978)
EC50>10000±n/a nM
Citation Lamotte, YMartres, PFaucher, NLaroze, AGrillot, DAncellin, NSaintillan, YBeneton, VGampe, RT Synthesis and biological activities of novel indole derivatives as potent and selective PPARgamma modulators. Bioorg Med Chem Lett20:1399-404 (2010) 
 
Peroxisome proliferator-activated receptor alpha
Name:Peroxisome proliferator-activated receptor alpha
Type:Enzyme
Mol. Mass.:52222.08
Organism:Homo sapiens (Human)
Description:Q07869
Residue:468
BDBM50306518
NameBDBM50306518
Synonyms:4'-((6-(1-phenylpropylcarbamoyl)-2-propyl-1H-benzo[d]imidazol-1-yl)methyl)biphenyl-2-carboxylic acid | CHEMBL601678
TypeSmall organic molecule
Emp. Form.C34H33N3O3
Mol. Mass.531.6441
SMILESCCCc1nc2ccc(cc2n1Cc1ccc(cc1)-c1ccccc1C(O)=O)C(=O)NC(CC)c1ccccc1