Reaction Details
TargetPeroxisome proliferator-activated receptor gamma
LigandBDBM50306510
Substrate/Competitorn/a
Meas. Tech.ChEMBL_610589 (CHEMBL1068981)
IC50 260±n/a nM
Citation Lamotte, YMartres, PFaucher, NLaroze, AGrillot, DAncellin, NSaintillan, YBeneton, VGampe, RT Synthesis and biological activities of novel indole derivatives as potent and selective PPARgamma modulators. Bioorg Med Chem Lett20:1399-404 (2010) 
 
Peroxisome proliferator-activated receptor gamma
Name:Peroxisome proliferator-activated receptor gamma
Type:Nuclear Receptor
Mol. Mass.:57613.46
Organism:Homo sapiens (Human)
Description:P37231
Residue:505
BDBM50306510
NameBDBM50306510
Synonyms:4'-((5-(2-phenylbutanamido)-2-propyl-1H-indol-1-yl)methyl)biphenyl-2-carboxylic acid | CHEMBL601222
TypeSmall organic molecule
Emp. Form.C35H34N2O3
Mol. Mass.530.6561
SMILESCCCc1cc2cc(NC(=O)C(CC)c3ccccc3)ccc2n1Cc1ccc(cc1)-c1ccccc1C(O)=O