Reaction Details
TargetPeroxisome proliferator-activated receptor gamma
LigandBDBM50085048
Substrate/Competitorn/a
Meas. Tech.ChEMBL_610592 (CHEMBL1069606)
EC50 13±n/a nM
Citation Lamotte, YMartres, PFaucher, NLaroze, AGrillot, DAncellin, NSaintillan, YBeneton, VGampe, RT Synthesis and biological activities of novel indole derivatives as potent and selective PPARgamma modulators. Bioorg Med Chem Lett20:1399-404 (2010) 
 
Peroxisome proliferator-activated receptor gamma
Name:Peroxisome proliferator-activated receptor gamma
Type:PROTEIN
Mol. Mass.:57593.55
Organism:Mus musculus
Description:ChEMBL_1453700
Residue:505
BDBM50085048
NameBDBM50085048
Synonyms:(S)-2-(2-Benzoyl-phenylamino)-3-{4-[2-(methyl-pyridin-2-yl-amino)-ethoxy]-phenyl}-propionic acid 2-(2-Benzoyl-phenylamino)-3-{4-[2-(methyl-pyridin-2-yl-amino)-ethoxy]-phenyl}-propionic acid | CHEMBL434063
TypeSmall organic molecule
Emp. Form.C30H29N3O4
Mol. Mass.495.569
SMILESCN(CCOc1ccc(C[C@H](Nc2ccccc2C(=O)c2ccccc2)C(O)=O)cc1)c1ccccn1