Reaction Details
TargetSerine/threonine-protein kinase mTOR
LigandBDBM50306629
Substrate/Competitorn/a
Meas. Tech.ChEMBL_611243 (CHEMBL1068272)
IC50 0.3±n/a nM
Citation Curran, KJVerheijen, JCKaplan, JRichard, DJToral-Barza, LHollander, ILucas, JAyral-Kaloustian, SYu, KZask, A Pyrazolopyrimidines as highly potent and selective, ATP-competitive inhibitors of the mammalian target of rapamycin (mTOR): optimization of the 1-substituent. Bioorg Med Chem Lett20:1440-4 (2010) 
 
Serine/threonine-protein kinase mTOR
Name:Serine/threonine-protein kinase mTOR
Type:Rapamycin target protein
Mol. Mass.:288917.12
Organism:Homo sapiens (Human)
Description:P42345
Residue:2549
BDBM50306629
NameBDBM50306629
Synonyms:CHEMBL606621 | cis-1-(4-(4-(8-oxa-3-azabicyclo[3.2.1]octan-3-yl)-1-(4-hydroxycyclohexyl)-1H-pyrazolo[3,4-d]pyrimidin-6-yl)phenyl)-3-methylurea
TypeSmall organic molecule
Emp. Form.C25H31N7O3
Mol. Mass.477.5587
SMILESCNC(=O)Nc1ccc(cc1)-c1nc(N2CC3CCC(C2)O3)c2cnn([C@@H]3CC[C@H](O)CC3)c2n1