Reaction Details
TargetP2Y purinoceptor 12
LigandBDBM50306941
Substrate/Competitorn/a
Meas. Tech.ChEMBL_609034 (CHEMBL1064501)
Ki 1.4±n/a nM
Citation Parlow, JJBurney, MWCase, BLGirard, TJHall, KAHarris, PKHiebsch, RRHuff, RMLachance, RMMischke, DARapp, SRWoerndle, RSEnnis, MD Part II: piperazinyl-glutamate-pyridines as potent orally bioavailable P2Y12 antagonists for inhibition of platelet aggregation. Bioorg Med Chem Lett20:1388-94 (2010) 
 
P2Y purinoceptor 12
Name:P2Y purinoceptor 12
Type:Enzyme
Mol. Mass.:39458.48
Organism:Homo sapiens (Human)
Description:Q9H244
Residue:342
BDBM50306941
NameBDBM50306941
Synonyms:(S)-5-oxo-5-(4-(pentyloxycarbonyl)piperazin-1-yl)-4-(6-phenyl-4-((R)-3-(pyrrolidine-1-carbonyl)pyrrolidin-1-yl)picolinamido)pentanoic acid | CHEMBL601485
TypeSmall organic molecule
Emp. Form.C36H48N6O7
Mol. Mass.676.8023
SMILESCCCCCOC(=O)N1CCN(CC1)C(=O)[C@H](CCC(O)=O)NC(=O)c1cc(cc(n1)-c1ccccc1)N1CC[C@H](C1)C(=O)N1CCCC1