Reaction Details
TargetP2Y purinoceptor 12
LigandBDBM50306958
Substrate/Competitorn/a
Meas. Tech.ChEMBL_609034 (CHEMBL1064501)
Ki 5.5±n/a nM
Citation Parlow, JJBurney, MWCase, BLGirard, TJHall, KAHarris, PKHiebsch, RRHuff, RMLachance, RMMischke, DARapp, SRWoerndle, RSEnnis, MD Part II: piperazinyl-glutamate-pyridines as potent orally bioavailable P2Y12 antagonists for inhibition of platelet aggregation. Bioorg Med Chem Lett20:1388-94 (2010) 
 
P2Y purinoceptor 12
Name:P2Y purinoceptor 12
Type:Enzyme
Mol. Mass.:39458.48
Organism:Homo sapiens (Human)
Description:Q9H244
Residue:342
BDBM50306958
NameBDBM50306958
Synonyms:(4S)-4-(4-(3-aminopiperidin-1-yl)-6-phenylpicolinamido)-5-oxo-5-(4-(pentyloxycarbonyl)piperazin-1-yl)pentanoic acid | CHEMBL601271
TypeSmall organic molecule
Emp. Form.C32H44N6O6
Mol. Mass.608.7284
SMILESCCCCCOC(=O)N1CCN(CC1)C(=O)[C@H](CCC(O)=O)NC(=O)c1cc(cc(n1)-c1ccccc1)N1CCCC(N)C1