Reaction Details
TargetMonoacylglycerol lipase ABHD6
LigandBDBM50307061
Substrate/Competitorn/a
Meas. Tech.ChEMBL_609360 (CHEMBL1072746)
IC50 550±n/a nM
Citation Long, JZJin, XAdibekian, ALi, WCravatt, BF Characterization of tunable piperidine and piperazine carbamates as inhibitors of endocannabinoid hydrolases. J Med Chem53:1830-42 (2010) 
 
Monoacylglycerol lipase ABHD6
Name:Monoacylglycerol lipase ABHD6
Type:Single-pass type II membrane protein; hydrolase
Mol. Mass.:38216.17
Organism:Mus musculus (mouse)
Description:Assays were using membranes of recombinant Abh6 transiently transfected in COS-7 cells.
Residue:336
BDBM50307061
NameBDBM50307061
Synonyms:4-Nitrophenyl 4-(Hydroxybis(4-methoxyphenyl)methyl)piperidine-1-carboxylate | CHEMBL599989
TypeSmall organic molecule
Emp. Form.C27H28N2O6
Mol. Mass.476.521
SMILESCOc1ccc(cc1)C(C1CCN(CC1)C(=O)Oc1ccc(cc1)[N+]([O-])=O)c1ccc(OC)cc1