Reaction Details
TargetFatty-acid amide hydrolase 1
LigandBDBM50307088
Substrate/Competitorn/a
Meas. Tech.ChEMBL_609358 (CHEMBL1072744)
IC50 720±n/a nM
Citation Long, JZJin, XAdibekian, ALi, WCravatt, BF Characterization of tunable piperidine and piperazine carbamates as inhibitors of endocannabinoid hydrolases. J Med Chem53:1830-42 (2010) 
 
Fatty-acid amide hydrolase 1
Name:Fatty-acid amide hydrolase 1
Type:Hydrolase; single-pass membrane protein; homodimer
Mol. Mass.:63227.28
Organism:Mus musculus (mouse)
Description:Mouse brain membranes were used in the assay.
Residue:579
BDBM50307088
NameBDBM50307088
Synonyms:4-Nitrophenyl 4-(5-Bromo-2-hydroxybenzyl)piperazine-1-carboxylate | CHEMBL591688
TypeSmall organic molecule
Emp. Form.C18H18BrN3O5
Mol. Mass.436.257
SMILESOc1ccc(Br)cc1CN1CCN(CC1)C(=O)Oc1ccc(cc1)[N+]([O-])=O