Reaction Details
TargetMonoglyceride lipase
LigandBDBM50307060
Substrate/Competitorn/a
Meas. Tech.ChEMBL_609359 (CHEMBL1072745)
IC50 80±n/a nM
Citation Long, JZJin, XAdibekian, ALi, WCravatt, BF Characterization of tunable piperidine and piperazine carbamates as inhibitors of endocannabinoid hydrolases. J Med Chem53:1830-42 (2010) 
 
Monoglyceride lipase
Name:Monoglyceride lipase
Type:Hydrolase
Mol. Mass.:33391.67
Organism:Mus musculus (mouse)
Description:Assays were using membranes of recombinant MAG Lipase transiently transfected in COS-7 cells.
Residue:303
BDBM50307060
NameBDBM50307060
Synonyms:4-Nitrophenyl 4-(Quinolin-2-ylmethyl)piperazine-1-carboxylate | CHEMBL597699
TypeSmall organic molecule
Emp. Form.C21H20N4O4
Mol. Mass.392.4079
SMILES[O-][N+](=O)c1ccc(OC(=O)N2CCN(Cc3ccc4ccccc4n3)CC2)cc1