Reaction Details
TargetMonoglyceride lipase
LigandBDBM50307074
Substrate/Competitorn/a
Meas. Tech.ChEMBL_609359 (CHEMBL1072745)
IC50 6120±n/a nM
Citation Long, JZJin, XAdibekian, ALi, WCravatt, BF Characterization of tunable piperidine and piperazine carbamates as inhibitors of endocannabinoid hydrolases. J Med Chem53:1830-42 (2010) 
 
Monoglyceride lipase
Name:Monoglyceride lipase
Type:Hydrolase
Mol. Mass.:33391.67
Organism:Mus musculus (mouse)
Description:Assays were using membranes of recombinant MAG Lipase transiently transfected in COS-7 cells.
Residue:303
BDBM50307074
NameBDBM50307074
Synonyms:4-Nitrophenyl 4-(9H-Xanthen-9-yl)piperazine-1-carboxylate | CHEMBL599990
TypeSmall organic molecule
Emp. Form.C24H21N3O5
Mol. Mass.431.4406
SMILES[O-][N+](=O)c1ccc(OC(=O)N2CCN(CC2)C2c3ccccc3Oc3ccccc23)cc1