Reaction Details
TargetMonoglyceride lipase
LigandBDBM50307079
Substrate/Competitorn/a
Meas. Tech.ChEMBL_609359 (CHEMBL1072745)
IC50>50000±n/a nM
Citation Long, JZJin, XAdibekian, ALi, WCravatt, BF Characterization of tunable piperidine and piperazine carbamates as inhibitors of endocannabinoid hydrolases. J Med Chem53:1830-42 (2010) 
 
Monoglyceride lipase
Name:Monoglyceride lipase
Type:Hydrolase
Mol. Mass.:33391.67
Organism:Mus musculus (mouse)
Description:Assays were using membranes of recombinant MAG Lipase transiently transfected in COS-7 cells.
Residue:303
BDBM50307079
NameBDBM50307079
Synonyms:4-nitrophenyl 3,3-diphenylpropyl(methyl)carbamate | CHEMBL602936
TypeSmall organic molecule
Emp. Form.C23H22N2O4
Mol. Mass.390.4318
SMILESCN(CCC(c1ccccc1)c1ccccc1)C(=O)Oc1ccc(cc1)[N+]([O-])=O