Reaction Details
TargetCytochrome P450 11B2, mitochondrial
LigandBDBM50307231
Substrate/Competitorn/a
Meas. Tech.ChEMBL_610340 (CHEMBL1072072)
IC50 1.7±n/a nM
Citation Roumen, LPeeters, JWEmmen, JMBeugels, IPCusters, EMde Gooyer, MPlate, RPieterse, KHilbers, PASmits, JFVekemans, JALeysen, DOttenheijm, HCJanssen, HMHermans, JJ Synthesis, biological evaluation, and molecular modeling of 1-benzyl-1H-imidazoles as selective inhibitors of aldosterone synthase (CYP11B2). J Med Chem53:1712-25 (2010) 
 
Cytochrome P450 11B2, mitochondrial
Name:Cytochrome P450 11B2, mitochondrial
Type:Protein
Mol. Mass.:57582.15
Organism:Homo sapiens (Human)
Description:P19099
Residue:503
BDBM50307231
NameBDBM50307231
Synonyms:1-(4-Cyanobenzyl)-5-phenyl-1H-imidazole | CHEMBL597578
TypeSmall organic molecule
Emp. Form.C17H13N3
Mol. Mass.259.3052
SMILESN#Cc1ccc(Cn2cncc2-c2ccccc2)cc1