Reaction Details
TargetProstaglandin E2 receptor EP3 subtype
LigandBDBM50307421
Substrate/Competitorn/a
Meas. Tech.ChEMBL_610980 (CHEMBL1070311)
IC50 39±n/a nM
Citation Asada, MIwahashi, MObitsu, TKinoshita, ANakai, YOnoda, TNagase, TTanaka, MYamaura, YTakizawa, HYoshikawa, KSato, KNarita, MOhuchida, SNakai, HToda, M 3-(2-Aminocarbonylphenyl)propanoic acid analogs as potent and selective EP3 receptor antagonists. part 2: optimization of the side chains to improve in vitro and in vivo potencies. Bioorg Med Chem18:1641-58 (2010) 
 
Prostaglandin E2 receptor EP3 subtype
Name:Prostaglandin E2 receptor EP3 subtype
Type:G-protein coupled receptor
Mol. Mass.:40092.50
Organism:Mus musculus (Mouse)
Description:n/a
Residue:365
BDBM50307421
NameBDBM50307421
Synonyms:3-[2-[({3-Methyl-1-[3-(trifluoromethyl)phenyl]butyl}-amino)carbonyl]-4-(phenoxymethyl)phenyl]propanoic acid | CHEMBL606181
TypeSmall organic molecule
Emp. Form.C29H30F3NO4
Mol. Mass.513.548
SMILESCC(C)CC(NC(=O)c1cc(COc2ccccc2)ccc1CCC(O)=O)c1cccc(c1)C(F)(F)F