Reaction Details
TargetProstaglandin E2 receptor EP3 subtype
LigandBDBM50307445
Substrate/Competitorn/a
Meas. Tech.ChEMBL_610979 (CHEMBL1070310)
Ki 0.13±n/a nM
Citation Asada, MIwahashi, MObitsu, TKinoshita, ANakai, YOnoda, TNagase, TTanaka, MYamaura, YTakizawa, HYoshikawa, KSato, KNarita, MOhuchida, SNakai, HToda, M 3-(2-Aminocarbonylphenyl)propanoic acid analogs as potent and selective EP3 receptor antagonists. part 2: optimization of the side chains to improve in vitro and in vivo potencies. Bioorg Med Chem18:1641-58 (2010) 
 
Prostaglandin E2 receptor EP3 subtype
Name:Prostaglandin E2 receptor EP3 subtype
Type:G-protein coupled receptor
Mol. Mass.:40092.50
Organism:Mus musculus (Mouse)
Description:n/a
Residue:365
BDBM50307445
NameBDBM50307445
Synonyms:3-[4-[(3-Cyanophenoxy)methyl]-2-({[1-(3-methoxyphenyl)-3-methylbutyl]amino}carbonyl)phenyl]propanoic acid | CHEMBL597974
TypeSmall organic molecule
Emp. Form.C30H32N2O5
Mol. Mass.500.5855
SMILESCOc1cccc(c1)C(CC(C)C)NC(=O)c1cc(COc2cccc(c2)C#N)ccc1CCC(O)=O