Reaction Details
TargetP2Y purinoceptor 12
LigandBDBM50307662
Substrate/Competitorn/a
Meas. Tech.ChEMBL_612285 (CHEMBL1064897)
Ki 1.5±n/a nM
Citation Parlow, JJBurney, MWCase, BLGirard, TJHall, KAHarris, PKHiebsch, RRHuff, RMLachance, RMMischke, DARapp, SRWoerndle, RSEnnis, MD Piperazinyl glutamate pyridines as potent orally bioavailable P2Y12 antagonists for inhibition of platelet aggregation. J Med Chem53:2010-37 (2010) 
 
P2Y purinoceptor 12
Name:P2Y purinoceptor 12
Type:Enzyme
Mol. Mass.:39458.48
Organism:Homo sapiens (Human)
Description:Q9H244
Residue:342
BDBM50307662
NameBDBM50307662
Synonyms:(4S)5-[4-(Butoxycarbonyl)iperazin-1-yl]-4-({[4-({[methyl-(tetrahydro-2H-pyran-4-ylmethyl)mino]carbonyl}oxy)6-phenylpyridin-2-yl]carbonyl}amino)5-oxopentanoic Acid | CHEMBL592850
TypeSmall organic molecule
Emp. Form.C34H45N5O9
Mol. Mass.667.7492
SMILESCCCCOC(=O)N1CCN(CC1)C(=O)[C@H](CCC(O)=O)NC(=O)c1cc(OC(=O)N(C)CC2CCOCC2)cc(n1)-c1ccccc1