Reaction Details
TargetP2Y purinoceptor 12
LigandBDBM50307003
Substrate/Competitorn/a
Meas. Tech.ChEMBL_612285 (CHEMBL1064897)
Ki 1.5±n/a nM
Citation Parlow, JJBurney, MWCase, BLGirard, TJHall, KAHarris, PKHiebsch, RRHuff, RMLachance, RMMischke, DARapp, SRWoerndle, RSEnnis, MD Piperazinyl glutamate pyridines as potent orally bioavailable P2Y12 antagonists for inhibition of platelet aggregation. J Med Chem53:2010-37 (2010) 
 
P2Y purinoceptor 12
Name:P2Y purinoceptor 12
Type:Enzyme
Mol. Mass.:39458.48
Organism:Homo sapiens (Human)
Description:Q9H244
Residue:342
BDBM50307003
NameBDBM50307003
Synonyms:(4S)5-[4-(Butoxycarbonyl)piperazin-1-yl]-5-oxo-4-[({6-phenyl-4-[4-(pyrrolidin-1-ylmethyl)piperidin-1-yl]pyridin-2-yl}carbonyl)amino]pentanoic Acid CHEMBL601478
TypeSmall organic molecule
Emp. Form.C36H50N6O6
Mol. Mass.662.8188
SMILESCCCCOC(=O)N1CCN(CC1)C(=O)[C@H](CCC(O)=O)NC(=O)c1cc(cc(n1)-c1ccccc1)N1CCC(CN2CCCC2)CC1