Reaction Details
TargetP2Y purinoceptor 12
LigandBDBM50307718
Substrate/Competitorn/a
Meas. Tech.ChEMBL_612285 (CHEMBL1064897)
Ki 2.8±n/a nM
Citation Parlow, JJBurney, MWCase, BLGirard, TJHall, KAHarris, PKHiebsch, RRHuff, RMLachance, RMMischke, DARapp, SRWoerndle, RSEnnis, MD Piperazinyl glutamate pyridines as potent orally bioavailable P2Y12 antagonists for inhibition of platelet aggregation. J Med Chem53:2010-37 (2010) 
 
P2Y purinoceptor 12
Name:P2Y purinoceptor 12
Type:Enzyme
Mol. Mass.:39458.48
Organism:Homo sapiens (Human)
Description:Q9H244
Residue:342
BDBM50307718
NameBDBM50307718
Synonyms:(4S)-4-({[4-(5-Hydroxypentyl)-6-phenylpyridin-2-yl]carbonyl}-amino)-5-oxo-5-{4-[(pentyloxy)carbonyl]piperazin-1-yl}pentanoic Acid | CHEMBL590990
TypeSmall organic molecule
Emp. Form.C32H44N4O7
Mol. Mass.596.7144
SMILESCCCCCOC(=O)N1CCN(CC1)C(=O)[C@H](CCC(O)=O)NC(=O)c1cc(CCCCCO)cc(n1)-c1ccccc1